Custom Query (1632 matches)

Filters
 
Or
 
  
 
Columns

Show under each result:


Results (1101 - 1200 of 1632)

2 3 4 5 6 7 8 9 10 11 12 13 14 15 16 17
Ticket Summary Owner Type Priority Milestone Component
#1130 signal-diagram: installation failure: unbound identifiers: `prelude/ML', `prelude/scheme' and `prelude/Octave' Ivan Raikov defect major someday extensions
#1132 Expansion of internal definitions ignores import status/redefinition of `define` et al. defect major 5.4 expander
#1133 segfault violation when using tcp-accept (as last s-exp?) defect critical someday core libraries
#1135 string-copy! bug defect major 4.10.0 core libraries
#1136 move-memory! bug similar to #1135 defect major 4.10.0 core libraries
#1137 sql-de-lite: use of ##sys#expand-home-path Jim Ursetto defect major someday extensions
#1138 sqlite3: use of ##sys#expand-home-path Thomas Chust defect major someday extensions
#1139 sql-de-lite: failure in tests: expected 1234567890125.0 but got 1234567890125 Jim Ursetto defect major someday extensions
#1140 Build failure on OS X 10.6.8 defect major someday build system
#1142 CR: remove queues, mmap, evict and binary search from core libraries felix winkelmann change request minor 5.0 core libraries
#1143 byte-string-* procedures not exported from utf8 egg Alex Shinn defect major someday extensions
#1144 chicken-install's -keep-installed and -prefix/-deploy options don't play nicely together enhancement minor 4.12.0 core tools
#1149 functor generated modules don't compile defect major someday unknown
#1150 irc: tcp-read-timeout not paramaterized everywhere that it needs to be felix winkelmann defect minor someday extensions
#1151 srfi-99: define-record-type doesn't properly define field accessor when the field name matches a previously defined symbol Thomas Chust defect minor someday extensions
#1152 Reserved pattern symbols break when a binding of the same name exists Alex Shinn defect major someday extensions
#1153 Behavior of normalize-pathname on the root directory defect minor 4.10.0 core libraries
#1154 error using 'bindings' egg from an 'included' script sjamaan defect major someday unknown
#1156 compiler warnings when import specifiers are used for setup-api and setup-download defect minor 5.0 unknown
#1157 test egg 'approx-equal?' bug? Alex Shinn defect major someday extensions
#1158 aand in the anaphora egg returns an unspecified value when one of the argument is #f juergen defect minor someday extensions
#1159 Handle -debug h without a source file defect minor 5.1 core tools
#1160 typed-lists: tests fail sometimes defect major someday extensions
#1161 irc egg fails at removing message handler defect minor someday extensions
#1163 nanomsg needs foreigners kristianlm defect major someday extensions
#1164 posix-shm: Error: (car) bad argument type: "" when shm-test return #f Ivan Raikov defect major someday extensions
#1166 Globally defining an identifier previously bound to a macro should shadow the macro fully sjamaan defect major 5.4 expander
#1167 nemo: cp: cannot stat `templates/NEST.tmpl': No such file or directory Ivan Raikov defect major someday extensions
#1169 *.setup-info installed with user login and group instead of root defect minor 5.0 core tools
#1170 kvlists needs setup-helper Peter Danenberg defect major someday extensions
#1171 combinatorics: the trick to conditionally include setup-helper-cock doesn't work Peter Danenberg defect major someday extensions
#1172 The overhead of loading import files is noticable defect major 5.0 core libraries
#1173 Symbols held in GC-roots are sometimes collected in "symbol-gc" mode defect major 5.0 core libraries
#1174 srfi-42: append-ec fails when apply limit is reached Ivan Raikov defect minor someday extensions
#1175 readline started failing on 2014-12-18 Alexej Magura defect major someday extensions
#1177 man pages deficient enhancement minor someday documentation
#1178 readline 3.0b2: test failures Alexej Magura defect major someday extensions
#1179 tween 1.1 needs the test egg for tests dleslie defect major someday extensions
#1181 memory corruption when user-interrupts and tcp defect major 4.11.0 unknown
#1182 utf8 egg silently accepts invalid byte sequences Alex Shinn enhancement major someday extensions
#1183 Syntax bound via let-syntax not bound in syntax-rules in its body defect minor 4.11.0 expander
#1184 lowdown: Error: (car) bad argument type: () Moritz Heidkamp defect major someday extensions
#1185 wrong sorting example for topological-sort defect major 5.3 core libraries
#1186 module-environment is broken for non-primitive modules defect major 4.11.0 core libraries
#1187 svn-client on Debian Jessie: dirent_uri.c:1500: uri_skip_ancestor: Assertion `svn_uri_is_canonical(child_uri, ((void *)0))' failed defect critical someday extensions
#1188 Compiler ignores nonexistent modules when generating import libraries defect minor 4.11.0 compiler
#1189 string-substitute \NUM syntax with preceding backslashes defect major 4.11.0 extensions
#1190 byte-blob: byte-blob->blob or byte-blob-object? defect major someday unknown
#1191 In deployed binaries, evaluated code cannot load modules evhan defect major 5.0 core libraries
#1192 mat5-lib, endian-blob and endian-port broken after byte-blob update Ivan Raikov defect major someday extensions
#1193 Ambiguity in csc's command line options defect major 5.0 core tools
#1194 autoload 2.1 still installs itself as version 2.0 Alex Shinn defect major someday extensions
#1195 ,q in csi gives an error sjamaan defect major 5.0 unknown
#1196 Static compilation doesn't respect $LIBDIR. defect major someday build system
#1197 Egg: Schelog Error: unbound variable: %set-of defect minor someday extensions
#1198 Allow `the` to override inferred types enhancement minor 4.10.0 scrutinizer
#1199 lolevel check error on NetBSD defect major 4.11.0 unknown
#1200 file->byte-blob can only read files in text mode on Windows defect minor someday extensions
#1201 random-mtzig update breaks some eggs Ivan Raikov defect major someday extensions
#1202 normalize-pathname expands paths started with dot-slash-slash wrongly. evhan defect major 4.10.0 core tools
#1203 Users manual hyperlink in index.html throws error in eww/emacs defect minor someday unknown
#1205 readline: versioning scheme has stuck it to 3.0b2 Alexej Magura defect critical someday extensions
#1206 typed-lists: test failures juergen defect major someday extensions
#1207 utf8: tests need the test egg Alex Shinn defect major someday extensions
#1208 yaml: error in tests defect major someday extensions
#1209 qrencode: installation failure acharlton defect major someday extensions
#1210 http-client should support SSL mutual authentication enhancement major someday unknown
#1211 apropos requires regex, but regex is not in the dependencies list Kon Lovett defect major someday extensions
#1212 dbus: tag a release? Shawn Rutledge defect major someday extensions
#1213 try-compile doesn't clean up tempfiles defect major 4.11.0 unknown
#1214 Specialization on certain `or' types doesn't work evhan defect minor someday scrutinizer
#1216 string-ref specialization elides range check defect critical 4.11.0 scrutinizer
#1218 chicken-install may fail if TMPDIR is mounted noexec (depending on setup-file details) defect major 5.0 extensions
#1219 read-char could be better optimized enhancement major 5.0 scrutinizer
#1220 Problems with chicken-status -f after using chicken-install -p Christian Kellermann defect minor someday unknown
#1221 Large / many constants cause segfaults defect critical 4.11.0 unknown
#1223 sigma egg seems to be missing import of utils defect minor someday extensions
#1224 Hahn-utils uninstallable on debian defect major someday extensions
#1225 Strange static compilation behaviour enhancement minor someday compiler
#1226 This code will trigger an inlining loop defect major someday compiler
#1227 parameterize bug defect major 4.11.0 core libraries
#1228 sets, typed-lists and arrays install the same file (sets.import.so) juergen defect critical someday extensions
#1229 bindings needs procedural-macros juergen defect major someday extensions
#1230 spatial-trees and kd-tree both install the same files (kd-tree.import.so and kd-tree.so) Ivan Raikov defect critical someday extensions
#1231 mutex-lock! leaves mutex in wrong state defect major 4.11.0 core libraries
#1232 signal handling smashes memory management defect critical 4.11.0 core libraries
#1234 graphs: installation failure (cannot import from undefined module: sets) Jeremy Steward defect major someday extensions
#1237 define-foreign-type causes confusing messages to be printed defect major someday compiler
#1239 parametric-curve's tests need matchable Ivan Raikov defect major someday extensions
#1240 logpro (tests): missing file: logprocessor.scm Matt Welland defect major someday extensions
#1242 salt (tests): missing file: vdp.sml Ivan Raikov defect major someday extensions
#1243 datatypes: error in tests: malformed expression: (define-concrete-type TYPE type? . variants) inside expression `(define-macro ...)' juergen defect major someday extensions
#1244 bencode: failure in tests Caolan McMahon defect major someday extensions
#1245 F-operator: multiple errors in tests Kon Lovett defect major someday extensions
#1246 sundials: error in tests (sh: 1: ./testsundials: not found) Ivan Raikov defect major someday unknown
#1248 bencode 1.1.1 reports its version as 1.0.0 Caolan McMahon defect major someday extensions
#1249 aes attempts to emit an import library out of the import source file Alaric Snell-Pym defect major someday extensions
#1250 gdbm attempts to emit an import library out of the import source file Alex Shinn defect major someday extensions
#1252 utf8-srfi-13 string-index-right treats bounds differently to srfi-13 Alex Shinn defect major someday extensions
#1253 utf8-srfi-13 string-map! does not update in-place Alex Shinn defect major someday extensions
2 3 4 5 6 7 8 9 10 11 12 13 14 15 16 17
Note: See TracQuery for help on using queries.