Custom Query (1629 matches)

Filters
 
Or
 
  
 
Columns

Show under each result:


Results (801 - 900 of 1629)

1 2 3 4 5 6 7 8 9 10 11 12 13 14 15 16 17
Ticket Summary Owner Type Priority Milestone Component
#1174 srfi-42: append-ec fails when apply limit is reached Ivan Raikov defect minor someday extensions
#1175 readline started failing on 2014-12-18 Alexej Magura defect major someday extensions
#1177 man pages deficient enhancement minor someday documentation
#1178 readline 3.0b2: test failures Alexej Magura defect major someday extensions
#1179 tween 1.1 needs the test egg for tests dleslie defect major someday extensions
#1182 utf8 egg silently accepts invalid byte sequences Alex Shinn enhancement major someday extensions
#1184 lowdown: Error: (car) bad argument type: () Moritz Heidkamp defect major someday extensions
#1187 svn-client on Debian Jessie: dirent_uri.c:1500: uri_skip_ancestor: Assertion `svn_uri_is_canonical(child_uri, ((void *)0))' failed defect critical someday extensions
#1190 byte-blob: byte-blob->blob or byte-blob-object? defect major someday unknown
#1192 mat5-lib, endian-blob and endian-port broken after byte-blob update Ivan Raikov defect major someday extensions
#1194 autoload 2.1 still installs itself as version 2.0 Alex Shinn defect major someday extensions
#1196 Static compilation doesn't respect $LIBDIR. defect major someday build system
#1197 Egg: Schelog Error: unbound variable: %set-of defect minor someday extensions
#1200 file->byte-blob can only read files in text mode on Windows defect minor someday extensions
#1201 random-mtzig update breaks some eggs Ivan Raikov defect major someday extensions
#1203 Users manual hyperlink in index.html throws error in eww/emacs defect minor someday unknown
#1205 readline: versioning scheme has stuck it to 3.0b2 Alexej Magura defect critical someday extensions
#1206 typed-lists: test failures juergen defect major someday extensions
#1207 utf8: tests need the test egg Alex Shinn defect major someday extensions
#1208 yaml: error in tests defect major someday extensions
#1209 qrencode: installation failure acharlton defect major someday extensions
#1210 http-client should support SSL mutual authentication enhancement major someday unknown
#1211 apropos requires regex, but regex is not in the dependencies list Kon Lovett defect major someday extensions
#1212 dbus: tag a release? Shawn Rutledge defect major someday extensions
#1214 Specialization on certain `or' types doesn't work evhan defect minor someday scrutinizer
#1220 Problems with chicken-status -f after using chicken-install -p Christian Kellermann defect minor someday unknown
#1223 sigma egg seems to be missing import of utils defect minor someday extensions
#1224 Hahn-utils uninstallable on debian defect major someday extensions
#1225 Strange static compilation behaviour enhancement minor someday compiler
#1226 This code will trigger an inlining loop defect major someday compiler
#1228 sets, typed-lists and arrays install the same file (sets.import.so) juergen defect critical someday extensions
#1229 bindings needs procedural-macros juergen defect major someday extensions
#1230 spatial-trees and kd-tree both install the same files (kd-tree.import.so and kd-tree.so) Ivan Raikov defect critical someday extensions
#1234 graphs: installation failure (cannot import from undefined module: sets) Jeremy Steward defect major someday extensions
#1237 define-foreign-type causes confusing messages to be printed defect major someday compiler
#1239 parametric-curve's tests need matchable Ivan Raikov defect major someday extensions
#1240 logpro (tests): missing file: logprocessor.scm Matt Welland defect major someday extensions
#1242 salt (tests): missing file: vdp.sml Ivan Raikov defect major someday extensions
#1243 datatypes: error in tests: malformed expression: (define-concrete-type TYPE type? . variants) inside expression `(define-macro ...)' juergen defect major someday extensions
#1244 bencode: failure in tests Caolan McMahon defect major someday extensions
#1245 F-operator: multiple errors in tests Kon Lovett defect major someday extensions
#1246 sundials: error in tests (sh: 1: ./testsundials: not found) Ivan Raikov defect major someday unknown
#1248 bencode 1.1.1 reports its version as 1.0.0 Caolan McMahon defect major someday extensions
#1249 aes attempts to emit an import library out of the import source file Alaric Snell-Pym defect major someday extensions
#1250 gdbm attempts to emit an import library out of the import source file Alex Shinn defect major someday extensions
#1252 utf8-srfi-13 string-index-right treats bounds differently to srfi-13 Alex Shinn defect major someday extensions
#1253 utf8-srfi-13 string-map! does not update in-place Alex Shinn defect major someday extensions
#1254 with-stty segfaults when current-input-port is not a terminal Alex Shinn defect major someday unknown
#1255 Parallel signal dispatch may corrupt the stack limit defect major someday core libraries
#1256 sdl-base should export modifier symbols megane defect major someday unknown
#1261 Rename the module exported by the kanren egg Alex Shinn task major someday extensions
#1262 suspension tests: assertion failure: Low-level type assertion C_blockp((C_word)C_VAL1(C__PREV_TMPST.n1))=#t felix winkelmann defect major someday extensions
#1263 glpk: installation failure Ivan Raikov defect major someday extensions
#1264 plot: installation failure Ivan Raikov defect major someday extensions
#1266 aes: installation failure Alaric Snell-Pym defect major someday extensions
#1267 graphs: installation failure Jeremy Steward defect major someday extensions
#1268 leveldb: installation failure (needs miscmacros) Caolan McMahon defect major someday extensions
#1271 Imlib2 image-create initializes w/ garbage defect major someday extensions
#1275 matchable: missing match.scm Alex Shinn defect critical someday extensions
#1281 coops does not compile with CHICKEN 4.11.0 rc 1 defect major someday extensions
#1282 bind does not compile with CHICKEN 4.11.0 rc 1 defect major someday extensions
#1284 Incorrect Expansion of => Clauses with Literals in Cond defect not urgent at all someday expander
#1287 csc -deploy fails with modules defect minor someday unknown
#1288 qwiki sections have no permalink sjamaan enhancement minor someday wiki
#1289 getopt-long (value #f) inconsistent with documentation defect major someday extensions
#1292 Unit posix: documentation incomplete defect not urgent at all someday core libraries
#1294 define-record-printer messes with internal defines defect major someday expander
#1296 Vandusen should accept commas beside colons Moritz Heidkamp enhancement major someday extensions
#1297 variables defined inside closure survive beyond closure! change request not urgent at all someday core libraries
#1299 Encoding of file "tests/compiler-tests.scm" is latin1 defect minor someday unknown
#1300 Broken image links in wiki.call-cc.org/logos felix winkelmann defect minor someday unknown
#1301 Wiki site title is "Chicken" instead of "CHICKEN" defect minor someday unknown
#1302 Syntax error for csc -postlude '(main)' defect minor someday unknown
#1304 fastcgi egg segfaults with SIGUSR1 defect minor someday extensions
#1306 The body of a syntax definer should be allowed to be a macro call defect major someday unknown
#1307 invalid number of parameters in install target on Windows defect minor someday build system
#1312 Wiki CSS breaks when the wiki page starts with <enscript ...> arthurmaciel defect minor someday wiki
#1313 map/for-each sometimes misbehave in interpreted code defect major someday unknown
#1316 Avoid define-macro warning in sxpath egg enhancement minor someday extensions
#1319 check-errors egg installation in GuixSD defect major someday extensions
#1324 setup-helper setup does not respect CHICKEN_INCLUDE_PATH Kon Lovett defect major someday extensions
#1326 load then import of module inside eval fails to find module defect major someday unknown
#1327 check-errors and mathh manually install files into chicken-home Kon Lovett defect major someday extensions
#1328 (import (only ...)) strange behaviour defect major someday unknown
#1330 spock generates unreachable code felix winkelmann defect major someday extensions
#1331 spock: "-escaping bug in write felix winkelmann defect major someday extensions
#1333 match from matchable doesn't handle keywords properly Alex Shinn defect major someday extensions
#1338 bindings 7.0: test failure (unbound variable: tagged-vector) juergen defect major someday extensions
#1345 bindings: test failure: Error: (car) bad argument type: () juergen defect major someday extensions
#1349 dbi 0.2: installation failure Matt Welland defect major someday extensions
#1352 unix-sockets egg uses deprecated(?) ##sys#pathname-resolution api defect major someday extensions
#1357 srfi-27 build error defect major someday unknown
#1358 (test-exit) returns 0 code for 'error in group outside of tests' Alex Shinn defect major someday extensions
#1359 mbox-string's mbox-file->messages does not obviously match its documentation Ivan Raikov defect major someday unknown
#1373 .egg-info's installed-files doesn't honor .egg's install-name defect major someday core tools
#1376 hide/block-global declaration doesn't hide exports defect minor someday compiler
#1377 Compiler tests hang on 32-bit mingw-msys defect major someday compiler
#1378 condition-utils uses error-utils, bot doesn't specify it as a dependency Kon Lovett defect major someday extensions
#1380 make check fails on Alpine Linux ppc64le defect major someday compiler
#1389 case-lambda expects 2 arguments defect major someday unknown
1 2 3 4 5 6 7 8 9 10 11 12 13 14 15 16 17
Note: See TracQuery for help on using queries.