Custom Query (1631 matches)

Filters
 
Or
 
  
 
Columns

Show under each result:


Results (1101 - 1200 of 1631)

2 3 4 5 6 7 8 9 10 11 12 13 14 15 16 17
Ticket Summary Owner Type Priority Milestone Component
#1042 numbers-syntax doesn't accept self-evaluating vectors defect minor someday extensions
#1044 stalin: salmonella-friendly tests felix winkelmann defect minor someday extensions
#1046 Fix letrec use in pstk defect major someday extensions
#1055 signal-diagram: reference to unbound identifier `E:Val' Ivan Raikov defect major someday extensions
#1056 yasos 1.2: Syntax error (import): cannot import from undefined module: simple-tests juergen defect major someday extensions
#1073 Spiffy should signal request-header-fields-too-large upon (exn http line-limit-exceeded) sjamaan defect major someday extensions
#1076 test failures: treaps, skiplists, random-access-lists, lazy-lists and continuations juergen defect major someday extensions
#1079 Implement pathname-expand defect minor 4.10.0 extensions
#1084 r7rs library include path trouble evhan defect major someday extensions
#1087 Error in statistics' tests petercrlane defect major someday extensions
#1088 freetds tests error: cannot open file - No such file or directory: "test-freetds-secret.scm" Peter Danenberg defect major someday extensions
#1089 parametric-curve: Error: assertion failed: (every (lambda (x y) (< (abs (- x y)) 1e-15)) ((sample-curve my-scaled-c) 5) (list 3.0 4.0 25.0)) Ivan Raikov defect major someday extensions
#1090 quaternions: error in tests: Error: (quotient) bad argument type - not an integer: 3.14159265 petercrlane defect major someday extensions
#1091 glut: unexpected exit on (use glut) felix winkelmann defect major someday extensions
#1092 amazon-s3 test errors thomashintz defect major someday extensions
#1099 low-level-macros: test failure starting on 2014-02-12 juergen defect major someday extensions
#1102 pty: tests need the test egg Alex Shinn defect major someday extensions
#1103 pty test script doesn't report failures (and one test fails) Alex Shinn defect major someday extensions
#1104 mat5-lib's tests leave temporary files Ivan Raikov defect major someday extensions
#1105 byte-blob's tests leave temporary files Ivan Raikov defect major someday extensions
#1108 sql-de-lite: test failure on Linux x86-64 (GCC, DEBUGBUILD) Jim Ursetto defect major someday extensions
#1111 soil: installation failure (GL/GL.h) dleslie defect major someday extensions
#1114 picnic: installation failure: reference to possibly unbound identifier `pcurve:compose-curve' in compose-curves Ivan Raikov defect major someday extensions
#1116 parametric-curve's tests need numbers Ivan Raikov defect major someday extensions
#1118 parley: Arrow key cursor movement doesn't work in csi with urxvt Christian Kellermann defect minor someday extensions
#1119 lazy-lists: installation failure: Syntax error (import): cannot import from undefined module: methods juergen defect major someday extensions
#1126 signal-diagram: installation failure: reference to possibly unbound identifier `sf' Ivan Raikov defect major someday extensions
#1130 signal-diagram: installation failure: unbound identifiers: `prelude/ML', `prelude/scheme' and `prelude/Octave' Ivan Raikov defect major someday extensions
#1137 sql-de-lite: use of ##sys#expand-home-path Jim Ursetto defect major someday extensions
#1138 sqlite3: use of ##sys#expand-home-path Thomas Chust defect major someday extensions
#1139 sql-de-lite: failure in tests: expected 1234567890125.0 but got 1234567890125 Jim Ursetto defect major someday extensions
#1143 byte-string-* procedures not exported from utf8 egg Alex Shinn defect major someday extensions
#1150 irc: tcp-read-timeout not paramaterized everywhere that it needs to be felix winkelmann defect minor someday extensions
#1151 srfi-99: define-record-type doesn't properly define field accessor when the field name matches a previously defined symbol Thomas Chust defect minor someday extensions
#1152 Reserved pattern symbols break when a binding of the same name exists Alex Shinn defect major someday extensions
#1157 test egg 'approx-equal?' bug? Alex Shinn defect major someday extensions
#1158 aand in the anaphora egg returns an unspecified value when one of the argument is #f juergen defect minor someday extensions
#1160 typed-lists: tests fail sometimes defect major someday extensions
#1161 irc egg fails at removing message handler defect minor someday extensions
#1163 nanomsg needs foreigners kristianlm defect major someday extensions
#1164 posix-shm: Error: (car) bad argument type: "" when shm-test return #f Ivan Raikov defect major someday extensions
#1167 nemo: cp: cannot stat `templates/NEST.tmpl': No such file or directory Ivan Raikov defect major someday extensions
#1170 kvlists needs setup-helper Peter Danenberg defect major someday extensions
#1171 combinatorics: the trick to conditionally include setup-helper-cock doesn't work Peter Danenberg defect major someday extensions
#1174 srfi-42: append-ec fails when apply limit is reached Ivan Raikov defect minor someday extensions
#1175 readline started failing on 2014-12-18 Alexej Magura defect major someday extensions
#1178 readline 3.0b2: test failures Alexej Magura defect major someday extensions
#1179 tween 1.1 needs the test egg for tests dleslie defect major someday extensions
#1182 utf8 egg silently accepts invalid byte sequences Alex Shinn enhancement major someday extensions
#1184 lowdown: Error: (car) bad argument type: () Moritz Heidkamp defect major someday extensions
#1187 svn-client on Debian Jessie: dirent_uri.c:1500: uri_skip_ancestor: Assertion `svn_uri_is_canonical(child_uri, ((void *)0))' failed defect critical someday extensions
#1189 string-substitute \NUM syntax with preceding backslashes defect major 4.11.0 extensions
#1192 mat5-lib, endian-blob and endian-port broken after byte-blob update Ivan Raikov defect major someday extensions
#1194 autoload 2.1 still installs itself as version 2.0 Alex Shinn defect major someday extensions
#1197 Egg: Schelog Error: unbound variable: %set-of defect minor someday extensions
#1200 file->byte-blob can only read files in text mode on Windows defect minor someday extensions
#1201 random-mtzig update breaks some eggs Ivan Raikov defect major someday extensions
#1205 readline: versioning scheme has stuck it to 3.0b2 Alexej Magura defect critical someday extensions
#1206 typed-lists: test failures juergen defect major someday extensions
#1207 utf8: tests need the test egg Alex Shinn defect major someday extensions
#1208 yaml: error in tests defect major someday extensions
#1209 qrencode: installation failure acharlton defect major someday extensions
#1211 apropos requires regex, but regex is not in the dependencies list Kon Lovett defect major someday extensions
#1212 dbus: tag a release? Shawn Rutledge defect major someday extensions
#1218 chicken-install may fail if TMPDIR is mounted noexec (depending on setup-file details) defect major 5.0 extensions
#1223 sigma egg seems to be missing import of utils defect minor someday extensions
#1224 Hahn-utils uninstallable on debian defect major someday extensions
#1228 sets, typed-lists and arrays install the same file (sets.import.so) juergen defect critical someday extensions
#1229 bindings needs procedural-macros juergen defect major someday extensions
#1230 spatial-trees and kd-tree both install the same files (kd-tree.import.so and kd-tree.so) Ivan Raikov defect critical someday extensions
#1234 graphs: installation failure (cannot import from undefined module: sets) Jeremy Steward defect major someday extensions
#1239 parametric-curve's tests need matchable Ivan Raikov defect major someday extensions
#1240 logpro (tests): missing file: logprocessor.scm Matt Welland defect major someday extensions
#1242 salt (tests): missing file: vdp.sml Ivan Raikov defect major someday extensions
#1243 datatypes: error in tests: malformed expression: (define-concrete-type TYPE type? . variants) inside expression `(define-macro ...)' juergen defect major someday extensions
#1244 bencode: failure in tests Caolan McMahon defect major someday extensions
#1245 F-operator: multiple errors in tests Kon Lovett defect major someday extensions
#1248 bencode 1.1.1 reports its version as 1.0.0 Caolan McMahon defect major someday extensions
#1249 aes attempts to emit an import library out of the import source file Alaric Snell-Pym defect major someday extensions
#1250 gdbm attempts to emit an import library out of the import source file Alex Shinn defect major someday extensions
#1252 utf8-srfi-13 string-index-right treats bounds differently to srfi-13 Alex Shinn defect major someday extensions
#1253 utf8-srfi-13 string-map! does not update in-place Alex Shinn defect major someday extensions
#1261 Rename the module exported by the kanren egg Alex Shinn task major someday extensions
#1262 suspension tests: assertion failure: Low-level type assertion C_blockp((C_word)C_VAL1(C__PREV_TMPST.n1))=#t felix winkelmann defect major someday extensions
#1263 glpk: installation failure Ivan Raikov defect major someday extensions
#1264 plot: installation failure Ivan Raikov defect major someday extensions
#1266 aes: installation failure Alaric Snell-Pym defect major someday extensions
#1267 graphs: installation failure Jeremy Steward defect major someday extensions
#1268 leveldb: installation failure (needs miscmacros) Caolan McMahon defect major someday extensions
#1271 Imlib2 image-create initializes w/ garbage defect major someday extensions
#1275 matchable: missing match.scm Alex Shinn defect critical someday extensions
#1281 coops does not compile with CHICKEN 4.11.0 rc 1 defect major someday extensions
#1282 bind does not compile with CHICKEN 4.11.0 rc 1 defect major someday extensions
#1289 getopt-long (value #f) inconsistent with documentation defect major someday extensions
#1290 Unit srfi-69: does not specify action when two merged hash tables contain the same keys defect minor 4.13.0 extensions
#1296 Vandusen should accept commas beside colons Moritz Heidkamp enhancement major someday extensions
#1304 fastcgi egg segfaults with SIGUSR1 defect minor someday extensions
#1316 Avoid define-macro warning in sxpath egg enhancement minor someday extensions
#1319 check-errors egg installation in GuixSD defect major someday extensions
#1324 setup-helper setup does not respect CHICKEN_INCLUDE_PATH Kon Lovett defect major someday extensions
2 3 4 5 6 7 8 9 10 11 12 13 14 15 16 17
Note: See TracQuery for help on using queries.