Custom Query (1631 matches)

Filters
 
Or
 
  
 
Columns

Show under each result:


Results (601 - 700 of 1631)

1 2 3 4 5 6 7 8 9 10 11 12 13 14 15 16 17
Ticket Summary Owner Type Priority Milestone Component
#963 tcp6 egg ignores (tcp-read-timeout #f) Jim Ursetto defect minor someday extensions
#964 honu 2.1 test failure: Error: call of non-procedure: #t felix winkelmann defect major someday extensions
#966 srfi-19 does not recognise the first item in abbreviation vectors for any language Kon Lovett defect major someday extensions
#973 seconds->date TIMEZONE-INFO argument defaults to #t Kon Lovett defect major someday extensions
#976 uuid-ossp uses deprecated null-pointer? predicate Kon Lovett defect major someday extensions
#977 make SSAX raise a proper condition when encountering a parse error instead of calling error felix winkelmann enhancement not urgent at all someday extensions
#982 stty output flags manipulate input flags in termios struct Alex Shinn defect major someday extensions
#984 irregex documentation example for irregex-search does not match implementation defect minor 4.9.0 extensions
#987 apropos uses foldl but does not state the correct chicken dependency Kon Lovett defect minor someday extensions
#990 allegro hardcodes include path for allegro to allegro5 dleslie defect major someday extensions
#992 peep still uses getenv felix winkelmann defect major someday extensions
#993 sigma uses obsolete find-file signature Ivan Raikov defect major someday extensions
#994 http-session's session-del! fails when the entry is the session-item's first binding Mario Domenech Goulart defect minor someday extensions
#996 skiplists needs simple-tests juergen defect major someday extensions
#997 uri-path-relative? misunderstands the root path sjamaan defect major someday extensions
#1000 srfi-19 egg has problem in time->srfi-18-time defect major someday extensions
#1009 sundials (BSD) depends on dyn-vector (GPL) Ivan Raikov defect major someday extensions
#1010 signal-diagram needs dyn-vector Ivan Raikov defect major someday extensions
#1012 getopt-long discards doublequotes and option values after whitespace characters Ivan Raikov defect minor someday extensions
#1017 socket-receive blocks for connectionless sockets Jim Ursetto defect major someday extensions
#1019 Different uri-common results for a hairy case sjamaan defect not urgent at all someday extensions
#1023 cgi egg tests fail Ivan Raikov defect minor someday extensions
#1024 dropbox egg installation failure andyjpb defect major someday extensions
#1025 vandusen installation failure Moritz Heidkamp defect major someday extensions
#1026 aima installation failure Peter Danenberg defect major someday extensions
#1027 log5scm installation failure certainty defect major someday extensions
#1029 sixtyfive-oh-two's tests need format felix winkelmann defect minor someday extensions
#1030 sqlite3: error in tests Thomas Chust defect minor someday extensions
#1031 uri-dispatch: errors and failures in tests certainty defect major someday extensions
#1032 srfi-40: a failure in tests Peter Danenberg defect minor someday extensions
#1033 zlib: one test fails joseph.gay defect minor someday extensions
#1034 sundials: assertion failure in tests Ivan Raikov defect minor someday extensions
#1035 bind: tests report a missing file (foreign-transformer-test.scm) felix winkelmann defect minor someday extensions
#1036 berkeley-db: tests need numbers Thomas Chust defect minor someday extensions
#1037 byte-blob-find fails on certain matches on 32-bit Chicken Ivan Raikov defect major someday extensions
#1038 byte-blob-find fails to matches at the end of a byte-blob Ivan Raikov defect minor someday extensions
#1040 coops: Hygiene issue with ensure-generic-procedure felix winkelmann defect minor someday extensions
#1042 numbers-syntax doesn't accept self-evaluating vectors defect minor someday extensions
#1044 stalin: salmonella-friendly tests felix winkelmann defect minor someday extensions
#1046 Fix letrec use in pstk defect major someday extensions
#1055 signal-diagram: reference to unbound identifier `E:Val' Ivan Raikov defect major someday extensions
#1056 yasos 1.2: Syntax error (import): cannot import from undefined module: simple-tests juergen defect major someday extensions
#1073 Spiffy should signal request-header-fields-too-large upon (exn http line-limit-exceeded) sjamaan defect major someday extensions
#1076 test failures: treaps, skiplists, random-access-lists, lazy-lists and continuations juergen defect major someday extensions
#1079 Implement pathname-expand defect minor 4.10.0 extensions
#1084 r7rs library include path trouble evhan defect major someday extensions
#1087 Error in statistics' tests petercrlane defect major someday extensions
#1088 freetds tests error: cannot open file - No such file or directory: "test-freetds-secret.scm" Peter Danenberg defect major someday extensions
#1089 parametric-curve: Error: assertion failed: (every (lambda (x y) (< (abs (- x y)) 1e-15)) ((sample-curve my-scaled-c) 5) (list 3.0 4.0 25.0)) Ivan Raikov defect major someday extensions
#1090 quaternions: error in tests: Error: (quotient) bad argument type - not an integer: 3.14159265 petercrlane defect major someday extensions
#1091 glut: unexpected exit on (use glut) felix winkelmann defect major someday extensions
#1092 amazon-s3 test errors thomashintz defect major someday extensions
#1099 low-level-macros: test failure starting on 2014-02-12 juergen defect major someday extensions
#1102 pty: tests need the test egg Alex Shinn defect major someday extensions
#1103 pty test script doesn't report failures (and one test fails) Alex Shinn defect major someday extensions
#1104 mat5-lib's tests leave temporary files Ivan Raikov defect major someday extensions
#1105 byte-blob's tests leave temporary files Ivan Raikov defect major someday extensions
#1108 sql-de-lite: test failure on Linux x86-64 (GCC, DEBUGBUILD) Jim Ursetto defect major someday extensions
#1111 soil: installation failure (GL/GL.h) dleslie defect major someday extensions
#1114 picnic: installation failure: reference to possibly unbound identifier `pcurve:compose-curve' in compose-curves Ivan Raikov defect major someday extensions
#1116 parametric-curve's tests need numbers Ivan Raikov defect major someday extensions
#1118 parley: Arrow key cursor movement doesn't work in csi with urxvt Christian Kellermann defect minor someday extensions
#1119 lazy-lists: installation failure: Syntax error (import): cannot import from undefined module: methods juergen defect major someday extensions
#1126 signal-diagram: installation failure: reference to possibly unbound identifier `sf' Ivan Raikov defect major someday extensions
#1130 signal-diagram: installation failure: unbound identifiers: `prelude/ML', `prelude/scheme' and `prelude/Octave' Ivan Raikov defect major someday extensions
#1137 sql-de-lite: use of ##sys#expand-home-path Jim Ursetto defect major someday extensions
#1138 sqlite3: use of ##sys#expand-home-path Thomas Chust defect major someday extensions
#1139 sql-de-lite: failure in tests: expected 1234567890125.0 but got 1234567890125 Jim Ursetto defect major someday extensions
#1143 byte-string-* procedures not exported from utf8 egg Alex Shinn defect major someday extensions
#1150 irc: tcp-read-timeout not paramaterized everywhere that it needs to be felix winkelmann defect minor someday extensions
#1151 srfi-99: define-record-type doesn't properly define field accessor when the field name matches a previously defined symbol Thomas Chust defect minor someday extensions
#1152 Reserved pattern symbols break when a binding of the same name exists Alex Shinn defect major someday extensions
#1157 test egg 'approx-equal?' bug? Alex Shinn defect major someday extensions
#1158 aand in the anaphora egg returns an unspecified value when one of the argument is #f juergen defect minor someday extensions
#1160 typed-lists: tests fail sometimes defect major someday extensions
#1161 irc egg fails at removing message handler defect minor someday extensions
#1163 nanomsg needs foreigners kristianlm defect major someday extensions
#1164 posix-shm: Error: (car) bad argument type: "" when shm-test return #f Ivan Raikov defect major someday extensions
#1167 nemo: cp: cannot stat `templates/NEST.tmpl': No such file or directory Ivan Raikov defect major someday extensions
#1170 kvlists needs setup-helper Peter Danenberg defect major someday extensions
#1171 combinatorics: the trick to conditionally include setup-helper-cock doesn't work Peter Danenberg defect major someday extensions
#1174 srfi-42: append-ec fails when apply limit is reached Ivan Raikov defect minor someday extensions
#1175 readline started failing on 2014-12-18 Alexej Magura defect major someday extensions
#1178 readline 3.0b2: test failures Alexej Magura defect major someday extensions
#1179 tween 1.1 needs the test egg for tests dleslie defect major someday extensions
#1182 utf8 egg silently accepts invalid byte sequences Alex Shinn enhancement major someday extensions
#1184 lowdown: Error: (car) bad argument type: () Moritz Heidkamp defect major someday extensions
#1187 svn-client on Debian Jessie: dirent_uri.c:1500: uri_skip_ancestor: Assertion `svn_uri_is_canonical(child_uri, ((void *)0))' failed defect critical someday extensions
#1189 string-substitute \NUM syntax with preceding backslashes defect major 4.11.0 extensions
#1192 mat5-lib, endian-blob and endian-port broken after byte-blob update Ivan Raikov defect major someday extensions
#1194 autoload 2.1 still installs itself as version 2.0 Alex Shinn defect major someday extensions
#1197 Egg: Schelog Error: unbound variable: %set-of defect minor someday extensions
#1200 file->byte-blob can only read files in text mode on Windows defect minor someday extensions
#1201 random-mtzig update breaks some eggs Ivan Raikov defect major someday extensions
#1205 readline: versioning scheme has stuck it to 3.0b2 Alexej Magura defect critical someday extensions
#1206 typed-lists: test failures juergen defect major someday extensions
#1207 utf8: tests need the test egg Alex Shinn defect major someday extensions
#1208 yaml: error in tests defect major someday extensions
#1209 qrencode: installation failure acharlton defect major someday extensions
#1211 apropos requires regex, but regex is not in the dependencies list Kon Lovett defect major someday extensions
1 2 3 4 5 6 7 8 9 10 11 12 13 14 15 16 17
Note: See TracQuery for help on using queries.