Custom Query (1631 matches)

Filters
 
Or
 
  
 
Columns

Show under each result:


Results (401 - 500 of 1631)

1 2 3 4 5 6 7 8 9 10 11 12 13 14 15
Ticket Summary Owner Type Priority Milestone Component
#1288 qwiki sections have no permalink sjamaan enhancement minor someday wiki
#1287 csc -deploy fails with modules defect minor someday unknown
#1285 parameterize doesn't restore current-{input,output,error}-port correctly defect critical 4.11.0 unknown
#1284 Incorrect Expansion of => Clauses with Literals in Cond defect not urgent at all someday expander
#1283 Runaway stack problem defect critical 4.11.0 core libraries
#1282 bind does not compile with CHICKEN 4.11.0 rc 1 defect major someday extensions
#1281 coops does not compile with CHICKEN 4.11.0 rc 1 defect major someday extensions
#1280 Literal decoding error when compiling for ARM64 defect critical 4.11.0 core libraries
#1279 debugger-client uses incorrect formatting strings for 32-bit systems defect major 4.11.0 core tools
#1278 Assertion failure on Debian/macppc with clang defect critical 4.11.0 unknown
#1277 Crash on Mac OS X defect critical 4.11.0 unknown
#1275 matchable: missing match.scm Alex Shinn defect critical someday extensions
#1274 read-all receiving #<unspecified> unless preceded by a predicate defect major 4.11.0 unknown
#1273 (use cairo) results in Error: (load) during expansion of (import ...) - unable to load compiled module defect critical 4.11.0 core libraries
#1272 string->number crash defect critical 4.11.0 core libraries
#1271 Imlib2 image-create initializes w/ garbage defect major someday extensions
#1270 process procedures should expect their env parameter in the same format get-environment-variables uses change request not urgent at all 5.0 core libraries
#1269 Port or reader state corruption defect critical 4.11.0 core libraries
#1268 leveldb: installation failure (needs miscmacros) Caolan McMahon defect major someday extensions
#1267 graphs: installation failure Jeremy Steward defect major someday extensions
#1266 aes: installation failure Alaric Snell-Pym defect major someday extensions
#1264 plot: installation failure Ivan Raikov defect major someday extensions
#1263 glpk: installation failure Ivan Raikov defect major someday extensions
#1262 suspension tests: assertion failure: Low-level type assertion C_blockp((C_word)C_VAL1(C__PREV_TMPST.n1))=#t felix winkelmann defect major someday extensions
#1261 Rename the module exported by the kanren egg Alex Shinn task major someday extensions
#1260 Make locative-ref inlineable defect major 4.12.0 unknown
#1258 At higher optimization levels, some scrutiny warnings disappear defect minor 5.2 scrutinizer
#1257 out-of-memory sometimes causes infinite loop defect major 5.0 unknown
#1256 sdl-base should export modifier symbols megane defect major someday unknown
#1255 Parallel signal dispatch may corrupt the stack limit defect major someday core libraries
#1254 with-stty segfaults when current-input-port is not a terminal Alex Shinn defect major someday unknown
#1253 utf8-srfi-13 string-map! does not update in-place Alex Shinn defect major someday extensions
#1252 utf8-srfi-13 string-index-right treats bounds differently to srfi-13 Alex Shinn defect major someday extensions
#1250 gdbm attempts to emit an import library out of the import source file Alex Shinn defect major someday extensions
#1249 aes attempts to emit an import library out of the import source file Alaric Snell-Pym defect major someday extensions
#1248 bencode 1.1.1 reports its version as 1.0.0 Caolan McMahon defect major someday extensions
#1246 sundials: error in tests (sh: 1: ./testsundials: not found) Ivan Raikov defect major someday unknown
#1245 F-operator: multiple errors in tests Kon Lovett defect major someday extensions
#1244 bencode: failure in tests Caolan McMahon defect major someday extensions
#1243 datatypes: error in tests: malformed expression: (define-concrete-type TYPE type? . variants) inside expression `(define-macro ...)' juergen defect major someday extensions
#1242 salt (tests): missing file: vdp.sml Ivan Raikov defect major someday extensions
#1240 logpro (tests): missing file: logprocessor.scm Matt Welland defect major someday extensions
#1239 parametric-curve's tests need matchable Ivan Raikov defect major someday extensions
#1237 define-foreign-type causes confusing messages to be printed defect major someday compiler
#1234 graphs: installation failure (cannot import from undefined module: sets) Jeremy Steward defect major someday extensions
#1232 signal handling smashes memory management defect critical 4.11.0 core libraries
#1231 mutex-lock! leaves mutex in wrong state defect major 4.11.0 core libraries
#1230 spatial-trees and kd-tree both install the same files (kd-tree.import.so and kd-tree.so) Ivan Raikov defect critical someday extensions
#1229 bindings needs procedural-macros juergen defect major someday extensions
#1228 sets, typed-lists and arrays install the same file (sets.import.so) juergen defect critical someday extensions
#1227 parameterize bug defect major 4.11.0 core libraries
#1226 This code will trigger an inlining loop defect major someday compiler
#1225 Strange static compilation behaviour enhancement minor someday compiler
#1224 Hahn-utils uninstallable on debian defect major someday extensions
#1223 sigma egg seems to be missing import of utils defect minor someday extensions
#1221 Large / many constants cause segfaults defect critical 4.11.0 unknown
#1220 Problems with chicken-status -f after using chicken-install -p Christian Kellermann defect minor someday unknown
#1219 read-char could be better optimized enhancement major 5.0 scrutinizer
#1218 chicken-install may fail if TMPDIR is mounted noexec (depending on setup-file details) defect major 5.0 extensions
#1216 string-ref specialization elides range check defect critical 4.11.0 scrutinizer
#1214 Specialization on certain `or' types doesn't work evhan defect minor someday scrutinizer
#1213 try-compile doesn't clean up tempfiles defect major 4.11.0 unknown
#1212 dbus: tag a release? Shawn Rutledge defect major someday extensions
#1211 apropos requires regex, but regex is not in the dependencies list Kon Lovett defect major someday extensions
#1210 http-client should support SSL mutual authentication enhancement major someday unknown
#1209 qrencode: installation failure acharlton defect major someday extensions
#1208 yaml: error in tests defect major someday extensions
#1207 utf8: tests need the test egg Alex Shinn defect major someday extensions
#1206 typed-lists: test failures juergen defect major someday extensions
#1205 readline: versioning scheme has stuck it to 3.0b2 Alexej Magura defect critical someday extensions
#1203 Users manual hyperlink in index.html throws error in eww/emacs defect minor someday unknown
#1202 normalize-pathname expands paths started with dot-slash-slash wrongly. evhan defect major 4.10.0 core tools
#1201 random-mtzig update breaks some eggs Ivan Raikov defect major someday extensions
#1200 file->byte-blob can only read files in text mode on Windows defect minor someday extensions
#1199 lolevel check error on NetBSD defect major 4.11.0 unknown
#1198 Allow `the` to override inferred types enhancement minor 4.10.0 scrutinizer
#1197 Egg: Schelog Error: unbound variable: %set-of defect minor someday extensions
#1196 Static compilation doesn't respect $LIBDIR. defect major someday build system
#1195 ,q in csi gives an error sjamaan defect major 5.0 unknown
#1194 autoload 2.1 still installs itself as version 2.0 Alex Shinn defect major someday extensions
#1193 Ambiguity in csc's command line options defect major 5.0 core tools
#1192 mat5-lib, endian-blob and endian-port broken after byte-blob update Ivan Raikov defect major someday extensions
#1191 In deployed binaries, evaluated code cannot load modules evhan defect major 5.0 core libraries
#1190 byte-blob: byte-blob->blob or byte-blob-object? defect major someday unknown
#1189 string-substitute \NUM syntax with preceding backslashes defect major 4.11.0 extensions
#1188 Compiler ignores nonexistent modules when generating import libraries defect minor 4.11.0 compiler
#1187 svn-client on Debian Jessie: dirent_uri.c:1500: uri_skip_ancestor: Assertion `svn_uri_is_canonical(child_uri, ((void *)0))' failed defect critical someday extensions
#1186 module-environment is broken for non-primitive modules defect major 4.11.0 core libraries
#1185 wrong sorting example for topological-sort defect major 5.3 core libraries
#1184 lowdown: Error: (car) bad argument type: () Moritz Heidkamp defect major someday extensions
#1183 Syntax bound via let-syntax not bound in syntax-rules in its body defect minor 4.11.0 expander
#1182 utf8 egg silently accepts invalid byte sequences Alex Shinn enhancement major someday extensions
#1181 memory corruption when user-interrupts and tcp defect major 4.11.0 unknown
#1179 tween 1.1 needs the test egg for tests dleslie defect major someday extensions
#1178 readline 3.0b2: test failures Alexej Magura defect major someday extensions
#1177 man pages deficient enhancement minor someday documentation
#1175 readline started failing on 2014-12-18 Alexej Magura defect major someday extensions
#1174 srfi-42: append-ec fails when apply limit is reached Ivan Raikov defect minor someday extensions
#1173 Symbols held in GC-roots are sometimes collected in "symbol-gc" mode defect major 5.0 core libraries
#1172 The overhead of loading import files is noticable defect major 5.0 core libraries
1 2 3 4 5 6 7 8 9 10 11 12 13 14 15
Note: See TracQuery for help on using queries.