Custom Query (1631 matches)

Filters
 
Or
 
  
 
Columns

Show under each result:


Results (1201 - 1300 of 1631)

3 4 5 6 7 8 9 10 11 12 13 14 15 16 17
Ticket Summary Owner Type Priority Milestone Component
#1186 module-environment is broken for non-primitive modules defect major 4.11.0 core libraries
#1189 string-substitute \NUM syntax with preceding backslashes defect major 4.11.0 extensions
#1190 byte-blob: byte-blob->blob or byte-blob-object? defect major someday unknown
#1191 In deployed binaries, evaluated code cannot load modules evhan defect major 5.0 core libraries
#1192 mat5-lib, endian-blob and endian-port broken after byte-blob update Ivan Raikov defect major someday extensions
#1193 Ambiguity in csc's command line options defect major 5.0 core tools
#1194 autoload 2.1 still installs itself as version 2.0 Alex Shinn defect major someday extensions
#1195 ,q in csi gives an error sjamaan defect major 5.0 unknown
#1196 Static compilation doesn't respect $LIBDIR. defect major someday build system
#1199 lolevel check error on NetBSD defect major 4.11.0 unknown
#1201 random-mtzig update breaks some eggs Ivan Raikov defect major someday extensions
#1202 normalize-pathname expands paths started with dot-slash-slash wrongly. evhan defect major 4.10.0 core tools
#1206 typed-lists: test failures juergen defect major someday extensions
#1207 utf8: tests need the test egg Alex Shinn defect major someday extensions
#1208 yaml: error in tests defect major someday extensions
#1209 qrencode: installation failure acharlton defect major someday extensions
#1210 http-client should support SSL mutual authentication enhancement major someday unknown
#1211 apropos requires regex, but regex is not in the dependencies list Kon Lovett defect major someday extensions
#1212 dbus: tag a release? Shawn Rutledge defect major someday extensions
#1213 try-compile doesn't clean up tempfiles defect major 4.11.0 unknown
#1218 chicken-install may fail if TMPDIR is mounted noexec (depending on setup-file details) defect major 5.0 extensions
#1219 read-char could be better optimized enhancement major 5.0 scrutinizer
#1224 Hahn-utils uninstallable on debian defect major someday extensions
#1226 This code will trigger an inlining loop defect major someday compiler
#1227 parameterize bug defect major 4.11.0 core libraries
#1229 bindings needs procedural-macros juergen defect major someday extensions
#1231 mutex-lock! leaves mutex in wrong state defect major 4.11.0 core libraries
#1234 graphs: installation failure (cannot import from undefined module: sets) Jeremy Steward defect major someday extensions
#1237 define-foreign-type causes confusing messages to be printed defect major someday compiler
#1239 parametric-curve's tests need matchable Ivan Raikov defect major someday extensions
#1240 logpro (tests): missing file: logprocessor.scm Matt Welland defect major someday extensions
#1242 salt (tests): missing file: vdp.sml Ivan Raikov defect major someday extensions
#1243 datatypes: error in tests: malformed expression: (define-concrete-type TYPE type? . variants) inside expression `(define-macro ...)' juergen defect major someday extensions
#1244 bencode: failure in tests Caolan McMahon defect major someday extensions
#1245 F-operator: multiple errors in tests Kon Lovett defect major someday extensions
#1246 sundials: error in tests (sh: 1: ./testsundials: not found) Ivan Raikov defect major someday unknown
#1248 bencode 1.1.1 reports its version as 1.0.0 Caolan McMahon defect major someday extensions
#1249 aes attempts to emit an import library out of the import source file Alaric Snell-Pym defect major someday extensions
#1250 gdbm attempts to emit an import library out of the import source file Alex Shinn defect major someday extensions
#1252 utf8-srfi-13 string-index-right treats bounds differently to srfi-13 Alex Shinn defect major someday extensions
#1253 utf8-srfi-13 string-map! does not update in-place Alex Shinn defect major someday extensions
#1254 with-stty segfaults when current-input-port is not a terminal Alex Shinn defect major someday unknown
#1255 Parallel signal dispatch may corrupt the stack limit defect major someday core libraries
#1256 sdl-base should export modifier symbols megane defect major someday unknown
#1257 out-of-memory sometimes causes infinite loop defect major 5.0 unknown
#1260 Make locative-ref inlineable defect major 4.12.0 unknown
#1261 Rename the module exported by the kanren egg Alex Shinn task major someday extensions
#1262 suspension tests: assertion failure: Low-level type assertion C_blockp((C_word)C_VAL1(C__PREV_TMPST.n1))=#t felix winkelmann defect major someday extensions
#1263 glpk: installation failure Ivan Raikov defect major someday extensions
#1264 plot: installation failure Ivan Raikov defect major someday extensions
#1266 aes: installation failure Alaric Snell-Pym defect major someday extensions
#1267 graphs: installation failure Jeremy Steward defect major someday extensions
#1268 leveldb: installation failure (needs miscmacros) Caolan McMahon defect major someday extensions
#1271 Imlib2 image-create initializes w/ garbage defect major someday extensions
#1274 read-all receiving #<unspecified> unless preceded by a predicate defect major 4.11.0 unknown
#1279 debugger-client uses incorrect formatting strings for 32-bit systems defect major 4.11.0 core tools
#1281 coops does not compile with CHICKEN 4.11.0 rc 1 defect major someday extensions
#1282 bind does not compile with CHICKEN 4.11.0 rc 1 defect major someday extensions
#1289 getopt-long (value #f) inconsistent with documentation defect major someday extensions
#1294 define-record-printer messes with internal defines defect major someday expander
#1295 module-environment use with macros defect major 5.4 core libraries
#1296 Vandusen should accept commas beside colons Moritz Heidkamp enhancement major someday extensions
#1298 Packaging in OpenEmbedded and Arch broken by CHICKEN 4.11.0 defect major 4.12.0 core tools
#1306 The body of a syntax definer should be allowed to be a macro call defect major someday unknown
#1313 map/for-each sometimes misbehave in interpreted code defect major someday unknown
#1314 The R5RS section of the manual does not document CHICKEN-specific extensions defect major 5.0 documentation
#1315 Move FAQ section from manual into wiki enhancement major 5.0 documentation
#1317 fibc hangs when compiled with -O3 or -O4 defect major 4.12.0 compiler
#1319 check-errors egg installation in GuixSD defect major someday extensions
#1322 Locale can influence how CHICKEN reads numbers defect major 4.12.0 core libraries
#1324 setup-helper setup does not respect CHICKEN_INCLUDE_PATH Kon Lovett defect major someday extensions
#1326 load then import of module inside eval fails to find module defect major someday unknown
#1327 check-errors and mathh manually install files into chicken-home Kon Lovett defect major someday extensions
#1328 (import (only ...)) strange behaviour defect major someday unknown
#1329 try-compile: optional argument to specify output file enhancement major 4.12.0 unknown
#1330 spock generates unreachable code felix winkelmann defect major someday extensions
#1331 spock: "-escaping bug in write felix winkelmann defect major someday extensions
#1332 keywords have no read/write invariance defect major 4.12.0 core libraries
#1333 match from matchable doesn't handle keywords properly Alex Shinn defect major someday extensions
#1334 csc's -prelude and -postlude options don't work defect major 4.12.0 compiler
#1337 Runtime crashes on C callbacks defect major 4.12.0 core libraries
#1338 bindings 7.0: test failure (unbound variable: tagged-vector) juergen defect major someday extensions
#1341 import-for-syntax doesn’t seem to work right when the imported module is in the same file defect major 5.0 compiler
#1342 define-record-type doesn't define type name defect major 5.0 core libraries
#1343 Unable to create R7RS libraries which don't import quote evhan defect major 5.1 unknown
#1344 Panic on "invalid encoded numeric literal" error on 64-bit Windows defect major 4.13.0 unknown
#1345 bindings: test failure: Error: (car) bad argument type: () juergen defect major someday extensions
#1346 define-external variables can't be exported felix winkelmann defect major 5.2 compiler
#1347 functor test fails when compiled on chicken-5 defect major 5.0 compiler
#1349 dbi 0.2: installation failure Matt Welland defect major someday extensions
#1352 unix-sockets egg uses deprecated(?) ##sys#pathname-resolution api defect major someday extensions
#1357 srfi-27 build error defect major someday unknown
#1358 (test-exit) returns 0 code for 'error in group outside of tests' Alex Shinn defect major someday extensions
#1359 mbox-string's mbox-file->messages does not obviously match its documentation Ivan Raikov defect major someday unknown
#1360 README instructions for building from git suggest setting LD_LIBRARY_PATH defect major 4.13.0 unknown
#1362 A case when composing with ir-macro-transformer defect major 4.13.0 expander
#1366 linking tests fail when "make check" is run without installing first defect major 5.0 compiler
#1368 Command line options for adding directories to include-path should prepend, not append defect major 5.0 core tools
#1373 .egg-info's installed-files doesn't honor .egg's install-name defect major someday core tools
#1374 `display' issue with UTF-8 defect major 5.4 core libraries
3 4 5 6 7 8 9 10 11 12 13 14 15 16 17
Note: See TracQuery for help on using queries.